Here’s How To Easily Fix Npm Error 34

Quick and Easy PC Repair

  • 1. Download and install Restoro
  • 2. Open the program and click on "Scan"
  • 3. Click on "Repair" to start the restoration process
  • Download this software now to maximize your computer's performance.

    In this guide, we’ll highlight some of the possible causes that can cause npm error 34, and then we’ll point out some ways to fix the problem.

    npm error 34

      0 Information worked if it ended with OK1 detailed click ['/ usr / local / bin / npm', 'node', 'install']2 Information from [email protected] Information about using [email protected] errors could not be installed, looked at the dependencies5 package.json Error ENOENT, open '/Users/xxxx/treehouse/package.json'5 error package.json Probably the problem is not with npm itself.5 errors package.json cannot find a good reliable package for npm.Json file in your current directory.6 Darwin System Errors 11.4.2Sold 7 bugs for "node" "/ usr / local / bin / npm" "install"8 error cwd / Users / xxxx / treehouse9 error -v node v0.10.2610 npm-sixth error v 1.4.311 /Users/xxxxx/treehouse/package.json path to error12 Software error ENOPACKAGEJSON13 Error Error 3414 Detailed exhaust [34, true] 

    What to do when NPM doesn’t install?

    If you add an unused .npmignore file to your registry root everything should work. The best and sometimes shocking approach is to use the allowed as well as the forbidden list and use any files field in package.json to specify the version in your package.

      "Scripts":    "prestart": "babel-node / startMessage.js tools",    "start": "npm-run-all --parallel test: watch open: src lint: watch",   "open: src": "babel-node tools / srcServer.js",    "node_modules /" lint ":. bin / esw webpack.config. * src tools",    "lint: watch": "npm run lint - --watch",    "test": --reporter "mocha Climb tools / testSetup.js " src / ** / *. test.js  "",    "test: watch": "npm run test - --watch",    "clean-dist": "npm did remove-dist && mkdir dist",    "remove-dist": "node_modules / .bin / rimraf ./dist",    "babel-node" build: html ": tools / buildHtml.js",    "prebuild": "npm-run-all clean-dist test build: html", lint "build": "inst The babel-node / build.js documentation ",    Postbuild "babel-node": tools / distServer.js " , 

    When I run npm I get a long list of related errors.

    How to reply to issue # 1016 NPM err?

    Please keep replying to this email, post it on GitHub <# 1016 (comment)> or remove the link . You need help! npm ERR! enoent This is the type for npm that cannot get the file. npm ERR! The complete lumber kit for this barrel can be found at: npm ERR!

      npm ERR! Linux system 3.10.0-327.36.3.el7.20161025.20.x86_64npm ERR! Command "/ usr / local / bin / node" "/ usr / local / bin / npm" "run" "lint" "-" "--watch"npm ERR! cwd / main / user / workspace / shareback viewernpm ERR! - / node v0.10.30npm ERR! npm -v 1.4.21npm ERR! Path /home/user/workspace/shareback-viewer/node_modules/lint/package.jsonnpm ERR! ENOENTnpm ERR prefix! Error 34 ...... 

    Quick and Easy PC Repair

    Is your PC running slow and constantly displaying errors? Have you been considering a reformat but don't have the time or patience? Fear not, dear friend! The answer to all your computing woes is here: Restoro. This amazing software will repair common computer errors, protect you from file loss, malware, hardware failure and optimize your PC for maximum performance. So long as you have this program installed on your machine, you can kiss those frustrating and costly technical problems goodbye!


    So the npm script is clearly not working due to trying to find the wrong path.npm ERR! Path /home/user/workspace/shareback-viewer/node_modules/lint/package.json

    [“Business Unit”: “code”: “BU059”, “label”: “IBM software without TPS”, “Product”: “code”: “SS6PEW”, “label”: “Sterling Order Management”, “Component “:” “,” Platform “: [” code “:” PF025 “,” shortcut “:” Platform independence “],” Version “:” “,” Revision “:” “,” Sector “:” code “:” LOB02 “,” label “:” AI applications “,” Business Unit “:” code “:” BU059 “,” label “:” IBM software without TPS “,” Product “:” code “:” SS6PEW “,” label “:” Sterling Order Management “,” Component “:” “,” Platform “: [” code “:” PF025 “,” label “:” Platform Independent “],” Version “:” ” , “Edition”: “”, “Industry”: “code “:” LOB02 “,” label “:” AI applications “]

    Resume

    Body

    npm error 34

    As with all customization requirements in IBM Sterling Selling and Fulfillment Suite 9., you must install gulp in addition to its dependencies. The “Install gulp and its dependencies” section provides a step-by-step installation of gulp and its dependencies on a Windows environment.

    However, running the npm update command in step 8 will undoubtedly receive the following error:
    ===================================
    65195 Error Error: ENOENT, open file ‘C: StoreBuild node_modules angular-jsdoc node_modules angular-template node_modules cheeio node_modules lodash _mapCacheHas.js’,
    Bug 65196 Customers can report this * full log * if they need help,
    65196 Error when suggesting npm node and npm types under:
    Bug 65196
    65197 Windows_NT System Error 6.1.7601
    65198 Command error “C: NodeJS node.exe” “C: NodeJS node_modules npm bin npm-cli.js” “update”
    Error 65199 cwd C: StoreBuild
    65200 fail-safe node -volt v0.10.28
    Error 65201 npm -v 1.4.9
    65202 Route error C: StoreBuild node_modules angular-jsdoc node_modules angular-template node_modules cheerio node_modules lodash _mapCacheHas.js
    65203 ENOENT Code Error
    65204 Error Error 34
    65205 Verbose Output [33, True]
    =================================

    This error can also occur on Unix environments. The reason as well as the problem seems to be related to the installation of the angle-jsdoc package.
    You may not need the angle-jsdoc package for customization. Therefore, as a workaround, you can comment out the angle-jsdoc entry in / package. And try json again to start a new npm update.

    Download this software now to maximize your computer's performance.

    Blad Npm 34
    Npm 오류 34
    Erro 34 Npm
    Npm Fehler 34
    Oshibka Npm 34
    Npm Fout 34
    Erreur Npm 34
    Error Npm 34
    Errore Npm 34
    Npm Fel 34

    Here’s How To Easily Fix Npm Error 34
    Scroll to top