So Können Sie Den Npm-Fehler 34 Einfach Korrigieren

Schnelle und einfache PC-Reparatur

  • 1. Laden Sie Restoro herunter und installieren Sie es
  • 2. Öffnen Sie das Programm und klicken Sie auf "Scannen"
  • 3. Klicken Sie auf "Reparieren", um den Wiederherstellungsvorgang zu starten
  • Laden Sie diese Software jetzt herunter, um die Leistung Ihres Computers zu maximieren.

    In diesem Skill-Leitfaden heben wir einige spezifische mögliche Ursachen hervor, die zu npm-Fehler 34 führen können, und zeigen dann einige Möglichkeiten zur Behebung des gesamten Problems auf.

    npm make a error 34

      0 Informationen werden ausgegeben, wenn sie mit OK geendet haben1 angegebener Klick ['/usr / local versus bin / npm', 'node', 'install']2 Informationen von [email protected] Informationen zur produzierenden Nutzung von [email protected] Fehler konnten nicht installiert werden, bei den Abhängigkeiten untersucht5 package.json Fehler ENOENT, öffnen Sie '/Users/xxxx/treehouse/package.json'5 error package.json Wahrscheinlich liegt das spezielle Problem nicht bei npm selbst.5 Probleme package.json kann kein geeignetes zuverlässiges Paket für die Datei npm.Json in Ihrem aktuellen Verzeichnis finden.6 Darwin-Systemfehler 11.4.2Verkauft 7 Bugs für "node" "/usr/local/bin npm" "install"8 Fehler cwd / Benutzer / xxxx / treehouse9 Fehler -elevision-Knoten v0.10.2610 npm-sechster Fehler sechster v 1.4.311 /Users/xxxxx/treehouse/package.json Pfad zum Fehler12 Softwarefehler ENOPACKAGEJSON13 Fehler Fehler 3414 Detaillierte Auspuffanlage [34, wahr] 

    Was tun, wenn NPM nicht installiert wird?

    Wenn Sie eine zusätzliche .npmignore-Datei für überschüssigen Kaffee zu Ihrer primären Registrierung hinzufügen, sollte alles funktionieren. Der beste und manchmal schockierende Ansatz besteht darin, sich sowohl auf die erlaubte als auch auf die verbotene Hauptliste zu verlassen und ein beliebiges Schreibarbeitsfeld in package.json zu verwenden, um anzugeben, wie die Version in Ihrem Paket ist.

      "Skripte":    "prestart": "babel-node - startMessage.js-Tools",    "start": "npm-run-all --parallel test: watch open: src lint: watch",   "open: src": "babel-node tools / srcServer.js",    "node_modules /" lint ":.pile /esw webpack.config.*src tools",    "lint: watch": "npm roam lint - --watch",    "test": --reporter "mocha Climbmachines/testSetup.js" src und **/*. test.js  "",    "test: watch": "npm führt test aus - --watch",    "clean-dist": "npm hat remove-dist && mkdir dist",    "remove-dist": "node_modules und .bin / rimraf ./dist",    "babel-node" build: html halber Zoll: tools / buildHtml.js",    "prebuild": "npm-run-all clean-dist test build: html", lint "build": "inst The babel-node versus build.js-Dokumentation",    Postbuild "babel-node": tools / distServer.js " , 

    Wenn ich npm verwende, erhalte ich eine lange Liste mit verwandten Fehlern.

    Wie reagiert man auf Problem Nr. 1016 NPM-Fehler?

    Bitte antworten Sie weiter auf diese E-Mail, notieren Sie sie auf GitHub <# 1016 (Kommentar)> und/oder entfernen Sie den Link . Sie benötigen Hilfe! npm ERR! enoent Dies ist der Typ für npm, in dem die Datei nicht abgerufen werden kann. npm ERR! Den kompletten Schnittholzbausatz für das Item Lauf finden Sie unter: npm ERR!

      npm ERR! Linux-Verfahren 3.10.0-327.36.3.el7.20161025.20.x86_64npm ERR! Befehl "/usr or local / bin / node" "/usr / local / bin npm" "run" "lint" "-" "--watch"npm ERR! cwd / main / user versus workspace / shareback viewernpm ERR! - / Knoten v0.10.30npm ERR! npm -w 1.4.21npm ERR! Pfad /home/user/workspace/shareback-viewer/node_modules/lint/package.jsonnpm ERR! ENOENTnpm ERR-Präfix! Fehler 34 ...... 

    Schnelle und einfache PC-Reparatur

    Läuft Ihr PC langsam und zeigt ständig Fehler an? Haben Sie über eine Neuformatierung nachgedacht, aber Ihnen fehlt die Zeit oder die Geduld? Fürchte dich nicht, lieber Freund! Die Antwort auf all Ihre Computerprobleme ist hier: Restoro. Diese erstaunliche Software repariert häufige Computerfehler, schützt Sie vor Dateiverlust, Malware und Hardwarefehlern und optimiert Ihren PC für maximale Leistung. Solange Sie dieses Programm auf Ihrem Computer installiert haben, können Sie sich von diesen frustrierenden und kostspieligen technischen Problemen verabschieden!


    Das npm-Skript funktioniert also definitiv nicht, weil es beantragt wurde, den falschen Pfad zu finden.npm ERR! Pfad /home/user/workspace/shareback-viewer/node_modules/lint/package.json

    [„Business Unit“: „Code“: „BU059“, ​​„Label“: „IBM Software ohne TPS“, „Produkt“: „Code“: „SS6PEW“, „Label“: „Sterling Order Management“, „Komponente“ :” “,” Plattform “: [” pin “:” PF025 “,” quick way “:” Plattformunabhängigkeit “],” Version “:” “,” Revision “:” “,” Sektor “:” Gutscheincode ” :” LOB02 “,” label “:” KI-Anwendungen “,” Business Unit “:” Gesetze “:” BU059 “,” label “:” IBM Software ohne TPS “,” Produkt “:” code “:” SS6PEW “, ” content label “:” Sterling Order Management “,” Component “:” “,” Platform”: [” software “:” PF025 “,” label “:” Platform Independent “],” Version “:” ” was ist ” Edition”: “”, “Industrie”: “code “:” LOB02 “,” label “:” KI-Anwendungen “]

    Lebenslauf

    Körper

    npm error message 34

    Wie bei allen Anpassungsanforderungen in IBM Sterling Selling und auch in Fulfillment Suite 9. müssen Sie in gulp zusätzlich zu ihren Abhängigkeiten platzieren. Der Abschnitt “Installieren von gulp und seinen eigenen Abhängigkeiten” bietet eine schrittweise Installation von allen gulp und seinen Abhängigkeiten in einigen Windows-Umgebungen.

    Wenn jedoch der Befehl npm update in Schritt 4 ausgeführt wird, wird zweifellos der Implementierungsfehler angezeigt:
    ===================================
    65195 Fehler Fehler: ENOENT, entsperrte Datei ‘C:StoreBuildnode_modulesangle-jsdocnode_modulesangle-templatenode_modulescheeionode_moduleslodash_mapCacheHas.js’,
    Fehler 65196 Kunden können dieses * typische Protokoll * melden, wenn sie es brauchen,
    65196 Fehler beim Vorschlagen von npm-Knoten, um npm-Typen nicht zu erwähnen unter:
    Fehler 65196
    65197 Windows_NT-Systemfehler 6.1.7601
    65198 Befehlsfehler “C: NodeJS node.exe” “C: NodeJS node_modules npm can npm-cli.js” “update”
    Fehler 65199 cwd C: StoreBuild
    65200 ausfallsicherer Knoten -Spannung v0.10.28
    Fehler 65201 npm -v 1.4.9
    65202 Routenfehler C: StoreBuild node_modules angle-jsdoc node_modules angle-template node_modules cheerio node_modules lodash _mapCacheHas.js
    65203 ENOENT-Code-Fehler
    65204 Fehler Fehler 34
    65205 Ausführliche Ausgabe [33, True]
    =================================

    Dieser Fehler kann auch in Unix-Umgebungen auftreten. Der Grund sowie die Komplikationen scheinen mit unserer eigenen Installation des angle-jsdoc-Pakets zusammenzuhängen.
    Sie würden die Winkel-jsdoc-Anordnung für die Anpassung nicht benötigen. Daher können Sie als brandneue Problemumgehung den angle-jsdoc-Eintrag einer Person in / package auskommentieren. Und versuchen Sie es erneut mit json, um ein ganz neues npm-Update zu starten.

    Laden Sie diese Software jetzt herunter, um die Leistung Ihres Computers zu maximieren.

    Npm Error 34
    Blad Npm 34
    Npm 오류 34
    Erro 34 Npm
    Oshibka Npm 34
    Npm Fout 34
    Erreur Npm 34
    Error Npm 34
    Errore Npm 34
    Npm Fel 34

    So Können Sie Den Npm-Fehler 34 Einfach Korrigieren
    Scroll to top